BDBM50083478 (R)-3-{[(R)-1-(3-Piperidin-4-yl-propionyl)-piperidine-3-carbonyl]-amino}-3-pyridin-3-yl-propionic acid::CHEMBL150533
SMILES OC(=O)C[C@@H](NC(=O)[C@@H]1CCCN(C1)C(=O)CCC1CCNCC1)c1cccnc1
InChI Key InChIKey=ABNXKGFLZFSILK-RTBURBONSA-N
Data  1 IC50
  Tab Delimited (TSV)   2D SDfile   Computed 3D by Vconf -m prep SDfile
Find this compound or compounds like it in BindingDB:
Activity Spreadsheet -- Enzyme Inhibition Constant Data from BindingDB
Found 1 hit for monomerid = 50083478
TargetIntegrin alpha-IIb/beta-3(Homo sapiens (Human))
The R. W. Johnson Pharmaceutical Research Institute
Curated by ChEMBL
LigandPNGBDBM50083478((R)-3-{[(R)-1-(3-Piperidin-4-yl-propionyl)-piperid...)
Affinity DataIC50:  0.360nM. Assay description: In vitro inhibition of biotinylated fibrinogen binding to immobolized fibrinogen receptor.
In DepthDetails ArticlePubMed