BDBM50083743 1N-[1-amino(imino)methyl-6-hydroxy-(5S)-tetrahydro-5-pyridinylcarbamoylmethyl]-5-amino(imino)methylamino-2-benzylsulfonamido-(2R)-pentanamide::CHEMBL117672
SMILES NC(=N)NCCCC(NS(=O)(=O)Cc1ccccc1)C(=O)NCC(=O)N[C@H]1CCCN(C1O)C(N)=N
InChI Key InChIKey=HSCSARKJCAZJSX-WUJZJPHMSA-N
Data  3 IC50
  Tab Delimited (TSV)   2D SDfile   Computed 3D by Vconf -m prep SDfile
Find this compound or compounds like it in BindingDB:
Activity Spreadsheet -- Enzyme Inhibition Constant Data from BindingDB
Found 3 hits for monomerid = 50083743
TargetProthrombin(Homo sapiens (Human))
Corvas International
Curated by ChEMBL
LigandPNGBDBM50083743(1N-[1-amino(imino)methyl-6-hydroxy-(5S)-tetrahydro...)
Affinity DataIC50: >2.50E+3nM. Assay description: In vitro inhibition of human Thrombin (FIIa).
In DepthDetails ArticlePubMed
TargetSerine protease 1(Homo sapiens (Human))
Corvas International
Curated by ChEMBL
LigandPNGBDBM50083743(1N-[1-amino(imino)methyl-6-hydroxy-(5S)-tetrahydro...)
Affinity DataIC50:  75nM. Assay description: In vitro inhibition of human trypsin.
In DepthDetails ArticlePubMed
TargetCoagulation factor X(Homo sapiens (Human))
Corvas International
Curated by ChEMBL
LigandPNGBDBM50083743(1N-[1-amino(imino)methyl-6-hydroxy-(5S)-tetrahydro...)
Affinity DataIC50:  0.700nM. Assay description: In vitro inhibition of human Factor Xa.
In DepthDetails ArticlePubMed