BDBM50083768 (S)3-({5-[4-(1H-Imidazol-2-ylamino)-butyl]-4,5-dihydro-isoxazole-3-carbonyl}-amino)-2-(2,4,6-trimethyl-benzenesulfonylamino)-propionic acid::2-Benzenesulfonylamino-3-({5-[4-(1H-imidazol-2-ylamino)-butyl]-4,5-dihydro-isoxazole-3-carbonyl}-amino)-propionic acid::CHEMBL338986
SMILES OC(=O)[C@H](CNC(=O)C1=NOC(CCCCNc2ncc[nH]2)C1)NS(=O)(=O)c1ccccc1
InChI Key InChIKey=VTKFSONVTHBFEO-JRZJBTRGSA-N
Data  5 IC50
  Tab Delimited (TSV)   2D SDfile   Computed 3D by Vconf -m prep SDfile
Find this compound or compounds like it in BindingDB:
Activity Spreadsheet -- Enzyme Inhibition Constant Data from BindingDB
Found 5 hits for monomerid = 50083768
TargetIntegrin alpha-IIb/beta-3(Homo sapiens (Human))
Dupont Pharmaceuticals
Curated by ChEMBL
LigandPNGBDBM50083768((S)3-({5-[4-(1H-Imidazol-2-ylamino)-butyl]-4,5-dih...)
Affinity DataIC50:  930nM. Assay description: Inhibition of platelet aggregation in human gel-purified platelets containing fibrinogen (GPP+Fg).
In DepthDetails ArticlePubMed
TargetIntegrin alpha-V/beta-3(Homo sapiens (Human))
Dupont Pharmaceuticals
Curated by ChEMBL
LigandPNGBDBM50083768((S)3-({5-[4-(1H-Imidazol-2-ylamino)-butyl]-4,5-dih...)
Affinity DataIC50:  10.6nM. Assay description: Inhibition of vitronectin receptor (alpha V beta 3), expressed on human 293 cells, binding to immobilized fibrinogen
In DepthDetails ArticlePubMed
TargetIntegrin alpha-IIb/beta-3(Homo sapiens (Human))
Dupont Pharmaceuticals
Curated by ChEMBL
LigandPNGBDBM50083768((S)3-({5-[4-(1H-Imidazol-2-ylamino)-butyl]-4,5-dih...)
Affinity DataIC50:  980nM. Assay description: Inhibition of platelet aggregation in human platelet rich plasma (PRP)
In DepthDetails ArticlePubMed
TargetIntegrin alpha-IIb/beta-3(Homo sapiens (Human))
Dupont Pharmaceuticals
Curated by ChEMBL
LigandPNGBDBM50083768((S)3-({5-[4-(1H-Imidazol-2-ylamino)-butyl]-4,5-dih...)
Affinity DataIC50:  890nM. Assay description: Inhibition of platelet aggregation in human gel-purified platelets containing fibrinogen (GPP+Fg).
In DepthDetails ArticlePubMed
TargetIntegrin alpha-V/beta-3(Homo sapiens (Human))
Dupont Pharmaceuticals
Curated by ChEMBL
LigandPNGBDBM50083768((S)3-({5-[4-(1H-Imidazol-2-ylamino)-butyl]-4,5-dih...)
Affinity DataIC50:  10.6nM. Assay description: Inhibition of vitronectin receptor (alpha V beta 3), expressed on human 293 cells, binding to immobilized fibrinogen
In DepthDetails ArticlePubMed