BDBM50084054 6'-Chloro-1-methyl-1,2,5,6-tetrahydro-[3,3']bipyridinyl; compound with (Z)-but-2-enedioic acid::CHEMBL1181055::CHEMBL154087
SMILES CN1CCC=C(C1)c1ccc(Cl)nc1
InChI Key InChIKey=YWDRNTZRCJXPPD-UHFFFAOYSA-N
Data  1 KI  1 IC50
  Tab Delimited (TSV)   2D SDfile   Computed 3D by Vconf -m prep SDfile
Find this compound or compounds like it in BindingDB:
Activity Spreadsheet -- Enzyme Inhibition Constant Data from BindingDB
Found 2 hits for monomerid = 50084054
TargetNeuronal acetylcholine receptor subunit alpha-4/beta-2(Homo sapiens (Human))
Targacept
Curated by ChEMBL
LigandPNGBDBM50084054(6'-Chloro-1-methyl-1,2,5,6-tetrahydro-[3,3']bipyri...)
Affinity DataKi:  2.20nM. Assay description: Binding affinity to alpha4beta2 nAChR
In DepthDetails ArticlePubMed
TargetMuscarinic acetylcholine receptor M2(RAT)
Institute Of Pharmacy And Biochemistry
Curated by ChEMBL
LigandPNGBDBM50084054(6'-Chloro-1-methyl-1,2,5,6-tetrahydro-[3,3']bipyri...)
Affinity DataIC50:  3.51E+3nM. Assay description: Inhibition of binding of [3H]-quinuclidinyl benzilate to Muscarinic acetylcholine receptor M2 in rat heart atria at 10e-5 M of compound concentration
In DepthDetails ArticlePubMed