BDBM50084059 (2S,5S)-2-Dodecyl-5-hydroxymethyl-1-methyl-1,4,5,6-tetrahydro-2H-benzo[e][1,4]diazocin-3-one::CHEMBL160375
SMILES CCCCCCCCCCCC[C@@H]1N(C)c2ccccc2C[C@@H](CO)NC1=O
InChI Key InChIKey=DBIHYDPHOBDVLD-GMAHTHKFSA-N
Data  1 KI
  Tab Delimited (TSV)   2D SDfile   Computed 3D by Vconf -m prep SDfile
Find this compound or compounds like it in BindingDB:
Activity Spreadsheet -- Enzyme Inhibition Constant Data from BindingDB
Found 1 hit for monomerid = 50084059
TargetProtein kinase C delta type(Homo sapiens (Human))
University Of Tokyo
Curated by ChEMBL
LigandPNGBDBM50084059((2S,5S)-2-Dodecyl-5-hydroxymethyl-1-methyl-1,4,5,6...)
Affinity DataKi:  0.800nM. Assay description: Binding affinity for human recombinant protein kinase C delta
In DepthDetails ArticlePubMed