BDBM50084132 3,5-Dibenzyl-[1,3,5]thiadiazinane-2-thione::CHEMBL151803::Sulbentine
SMILES S=C1SCN(Cc2ccccc2)CN1Cc1ccccc1
InChI Key InChIKey=QFVAWNPSRQWSDU-UHFFFAOYSA-N
Data  2 IC50
  Tab Delimited (TSV)   2D SDfile   Computed 3D by Vconf -m prep SDfile
Find this compound or compounds like it in BindingDB:
Activity Spreadsheet -- Enzyme Inhibition Constant Data from BindingDB
Found 2 hits for monomerid = 50084132
TargetMu-type opioid receptor(Rattus norvegicus (rat))
The University Of Arizona
Curated by ChEMBL
LigandPNGBDBM50084132(3,5-Dibenzyl-[1,3,5]thiadiazinane-2-thione | CHEMB...)
Affinity DataIC50:  2.79E+4nM. Assay description: In vitro inhibition of [3H]-DAMGO (Tyr-D-Ala-Gly-(Me)-Phe-Gly-ol) binding to Opioid receptor mu 1 using rat brain membranes
In DepthDetails ArticlePubMed
TargetDelta-type opioid receptor(Rattus norvegicus (rat))
The University Of Arizona
Curated by ChEMBL
LigandPNGBDBM50084132(3,5-Dibenzyl-[1,3,5]thiadiazinane-2-thione | CHEMB...)
Affinity DataIC50:  2.86E+4nM. Assay description: In vitro inhibition of [3H]- [p-Cl-Phe4]DPDPE binding to Opioid receptor delta 1 using rat brain membranes.
In DepthDetails ArticlePubMed