BDBM86717 CAS_5218788::CHEMBL88553::NSC_5218788::SIB-1757
SMILES Cc1ccc(O)c(N=Nc2ccccc2)n1
InChI Key InChIKey=LOCPVWIREQIGNQ-UHFFFAOYSA-N
Data  13 KI  3 IC50
  Tab Delimited (TSV)   2D SDfile   Computed 3D by Vconf -m prep SDfile
Find this compound or compounds like it in BindingDB:
Activity Spreadsheet -- Enzyme Inhibition Constant Data from BindingDB
Found 16 hits for monomerid = 86717
TargetMetabotropic glutamate receptor 5(Homo sapiens (Human))
F. Hoffmann-La Roche
Curated by PDSP Ki Database
LigandPNGBDBM86717(CAS_5218788 | CHEMBL88553 | NSC_5218788 | SIB-1757)
Affinity DataKi:  328nM
In DepthDetails ArticlePubMed
TargetMetabotropic glutamate receptor 5(Rattus norvegicus (Rat))
F. Hoffmann-La Roche
Curated by PDSP Ki Database
LigandPNGBDBM86717(CAS_5218788 | CHEMBL88553 | NSC_5218788 | SIB-1757)
Affinity DataKi:  346nM
In DepthDetails ArticlePubMed
TargetMetabotropic glutamate receptor 5(Homo sapiens (Human))
F. Hoffmann-La Roche
Curated by PDSP Ki Database
LigandPNGBDBM86717(CAS_5218788 | CHEMBL88553 | NSC_5218788 | SIB-1757)
Affinity DataKi:  357nM
In DepthDetails ArticlePubMed
TargetMetabotropic glutamate receptor 5(Homo sapiens (Human))
F. Hoffmann-La Roche
Curated by PDSP Ki Database
LigandPNGBDBM86717(CAS_5218788 | CHEMBL88553 | NSC_5218788 | SIB-1757)
Affinity DataKi:  370nM. Assay description: Agonist potency against cloned metabotropic glutamate receptor 5
In DepthDetails ArticlePubMed
TargetMetabotropic glutamate receptor 5(Rattus norvegicus (Rat))
F. Hoffmann-La Roche
Curated by PDSP Ki Database
LigandPNGBDBM86717(CAS_5218788 | CHEMBL88553 | NSC_5218788 | SIB-1757)
Affinity DataKi:  486nM
In DepthDetails ArticlePubMed
TargetMetabotropic glutamate receptor 5(Homo sapiens (Human))
F. Hoffmann-La Roche
Curated by PDSP Ki Database
LigandPNGBDBM86717(CAS_5218788 | CHEMBL88553 | NSC_5218788 | SIB-1757)
Affinity DataKi:  1.10E+3nM
In DepthDetails ArticlePubMed
TargetMetabotropic glutamate receptor 7(Homo sapiens (Human))
The Royal Danish School Of Pharmacy
Curated by ChEMBL
LigandPNGBDBM86717(CAS_5218788 | CHEMBL88553 | NSC_5218788 | SIB-1757)
Affinity DataKi: >1.00E+5nM. Assay description: Agonist potency against cloned Metabotropic glutamate receptor 7 (mGluR-7).
In DepthDetails ArticlePubMed
TargetMetabotropic glutamate receptor 2(Homo sapiens (Human))
The Royal Danish School Of Pharmacy
Curated by ChEMBL
LigandPNGBDBM86717(CAS_5218788 | CHEMBL88553 | NSC_5218788 | SIB-1757)
Affinity DataKi: >1.00E+5nM. Assay description: Antagonist potency against cloned Metabotropic glutamate receptor 2
In DepthDetails ArticlePubMed
TargetMetabotropic glutamate receptor 4(Homo sapiens (Human))
The Royal Danish School Of Pharmacy
Curated by ChEMBL
LigandPNGBDBM86717(CAS_5218788 | CHEMBL88553 | NSC_5218788 | SIB-1757)
Affinity DataKi: >1.00E+5nM. Assay description: Agonist potency against cloned human Metabotropic glutamate receptor 4 (mGluR-4)
In DepthDetails ArticlePubMed
TargetMetabotropic glutamate receptor 1(Homo sapiens (Human))
The Royal Danish School Of Pharmacy
Curated by ChEMBL
LigandPNGBDBM86717(CAS_5218788 | CHEMBL88553 | NSC_5218788 | SIB-1757)
Affinity DataKi: >1.00E+5nM. Assay description: Agonist potency against cloned human metabotropic glutamate receptor 1
In DepthDetails ArticlePubMed
TargetMetabotropic glutamate receptor 6(Homo sapiens (Human))
The Royal Danish School Of Pharmacy
Curated by ChEMBL
LigandPNGBDBM86717(CAS_5218788 | CHEMBL88553 | NSC_5218788 | SIB-1757)
Affinity DataKi: >1.00E+5nM. Assay description: Agonist potency against cloned Metabotropic glutamate receptor 6 (mGluR-6).
In DepthDetails ArticlePubMed
TargetMetabotropic glutamate receptor 3(Homo sapiens (Human))
The Royal Danish School Of Pharmacy
Curated by ChEMBL
LigandPNGBDBM86717(CAS_5218788 | CHEMBL88553 | NSC_5218788 | SIB-1757)
Affinity DataKi: >1.00E+5nM. Assay description: Agonist potency against cloned Metabotropic glutamate receptor 3 (mGluR-3).
In DepthDetails ArticlePubMed
TargetMetabotropic glutamate receptor 8(Homo sapiens (Human))
The Royal Danish School Of Pharmacy
Curated by ChEMBL
LigandPNGBDBM86717(CAS_5218788 | CHEMBL88553 | NSC_5218788 | SIB-1757)
Affinity DataKi: >1.00E+5nM. Assay description: Agonist potency against cloned Metabotropic glutamate receptor 8 (mGluR-8).
In DepthDetails ArticlePubMed
TargetMetabotropic glutamate receptor 1(Homo sapiens (Human))
The Royal Danish School Of Pharmacy
Curated by ChEMBL
LigandPNGBDBM86717(CAS_5218788 | CHEMBL88553 | NSC_5218788 | SIB-1757)
Affinity DataIC50: >1.00E+5nM. Assay description: Compound was tested for its agonist activity against Ser165 and Thr188 (Metabotropic glutamate receptor 1) receptor.
In DepthDetails ArticlePubMed
TargetMetabotropic glutamate receptor 5(Rattus norvegicus (Rat))
F. Hoffmann-La Roche
Curated by PDSP Ki Database
LigandPNGBDBM86717(CAS_5218788 | CHEMBL88553 | NSC_5218788 | SIB-1757)
Affinity DataIC50:  1.17E+3nM. Assay description: Inhibition of [3H]MPEP binding to mGluR5 in rat brain membrane
In DepthDetails ArticlePubMed
TargetMetabotropic glutamate receptor 5(Homo sapiens (Human))
F. Hoffmann-La Roche
Curated by PDSP Ki Database
LigandPNGBDBM86717(CAS_5218788 | CHEMBL88553 | NSC_5218788 | SIB-1757)
Affinity DataIC50:  370nM. Assay description: Compound was tested for it's antagonist activity against Ser152 and Thr175 (Metabotropic glutamate receptor 5)
In DepthDetails ArticlePubMed