BDBM50084437 Batefenterol::GSK961081::GSK961081A::TD-5959
SMILES COc1cc(NC(=O)CCN2CCC(CC2)OC(=O)Nc2ccccc2-c2ccccc2)c(Cl)cc1CNC[C@H](O)c1ccc(O)c2[nH]c(=O)ccc12
InChI Key InChIKey=URWYQGVSPQJGGB-DHUJRADRSA-N
Data  1 KI  1 IC50  2 EC50
  Tab Delimited (TSV)   2D SDfile   Computed 3D by Vconf -m prep SDfile
Find this compound or compounds like it in BindingDB:
Activity Spreadsheet -- Enzyme Inhibition Constant Data from BindingDB
Found 4 hits for monomerid = 50084437
TargetMuscarinic acetylcholine receptor M3(Homo sapiens (Human))
Theravance Biopharma
Curated by ChEMBL
LigandPNGBDBM50084437(Batefenterol | GSK961081 | GSK961081A | TD-5959)
Affinity DataKi:  2nM. Assay description: Displacement of [3H]NMS from human muscarinic M3 receptor expressing CHO-K1 cells incubated for 60 mins or 6 hrs by liquid scintillation counting
In DepthDetails ArticlePubMed
TargetMuscarinic acetylcholine receptor M3(Homo sapiens (Human))
Theravance Biopharma
Curated by ChEMBL
LigandPNGBDBM50084437(Batefenterol | GSK961081 | GSK961081A | TD-5959)
Affinity DataIC50:  1.60nM. Assay description: Antagonist activity at human M3 receptor
In DepthDetails ArticlePubMed
TargetBeta-2 adrenergic receptor(Homo sapiens (Human))
School Of Pharmaceutical Sciences & The Fifth Affiliated Hospital
Curated by ChEMBL
LigandPNGBDBM50084437(Batefenterol | GSK961081 | GSK961081A | TD-5959)
Affinity DataEC50:  0.251nM. Assay description: Agonist activity at human beta2 adrenoceptor
In DepthDetails ArticlePubMed
TargetBeta-2 adrenergic receptor(Homo sapiens (Human))
School Of Pharmaceutical Sciences & The Fifth Affiliated Hospital
Curated by ChEMBL
LigandPNGBDBM50084437(Batefenterol | GSK961081 | GSK961081A | TD-5959)
Affinity DataEC50:  0.251nM. Assay description: Agonist activity at human beta2 adrenergic receptor expressed in HEK293 cells assessed as cAMP accumulation using [125I]cAMP by scintillation countin...
In DepthDetails ArticlePubMed