BDBM50084455 CHEMBL3426871
SMILES CN1CCN(CC1)c1ccc(Nc2ncc(Cl)c(NCC3CCCO3)n2)cc1
InChI Key InChIKey=MMJSYUQCKWEFRW-UHFFFAOYSA-N
Data  1 IC50
PDB links: 1 PDB ID matches this monomer.
  Tab Delimited (TSV)   2D SDfile   Computed 3D by Vconf -m prep SDfile
Find this compound or compounds like it in BindingDB:
Activity Spreadsheet -- Enzyme Inhibition Constant Data from BindingDB
Found 1 hit for monomerid = 50084455
TargetActivated CDC42 kinase 1(Homo sapiens (Human))
University Of South Florida
Curated by ChEMBL
LigandPNGBDBM50084455(CHEMBL3426871)
Affinity DataIC50:  54nM. Assay description: Inhibition of human ACK1 using EAIYAAPFAKKK peptide substrate by 33P Hotspot assay