BDBM50084554 2,6-Diisopropyl-1-{[4-(3-methyl-5-sulfamoyl-3H-[1,3,4]thiadiazol-2-ylidenesulfamoyl)-phenylcarbamoyl]-methyl}-4-phenyl-pyridinium; perchlorate::CHEMBL97795
SMILES CC(C)c1cc(cc(C(C)C)[n+]1CC(=O)Nc1ccc(cc1)S(=O)(=O)\N=c1\sc(nn1C)S(N)(=O)=O)-c1ccccc1
InChI Key InChIKey=KCQUSTRLBHEXNM-QVAGMWBUSA-O
Data  3 KI
  Tab Delimited (TSV)   2D SDfile   Computed 3D by Vconf -m prep SDfile
Find this compound or compounds like it in BindingDB:
Activity Spreadsheet -- Enzyme Inhibition Constant Data from BindingDB
Found 3 hits for monomerid = 50084554
TargetCarbonic anhydrase 2(Homo sapiens (Human))
Università
Curated by ChEMBL
LigandPNGBDBM50084554(2,6-Diisopropyl-1-{[4-(3-methyl-5-sulfamoyl-3H-[1,...)
Affinity DataKi:  4nM. Assay description: Inhibitory activity against human carbonic anhydrase II (CA2)
In DepthDetails ArticlePubMed
TargetCarbonic anhydrase 4(Bos taurus (bovine))
Università
Curated by ChEMBL
LigandPNGBDBM50084554(2,6-Diisopropyl-1-{[4-(3-methyl-5-sulfamoyl-3H-[1,...)
Affinity DataKi:  10nM. Assay description: Inhibitory activity against bovine carbonic anhydrase IV (CA4), isolated from bovine lung microsomes
In DepthDetails ArticlePubMed
TargetCarbonic anhydrase 1(Homo sapiens (Human))
Università
Curated by ChEMBL
LigandPNGBDBM50084554(2,6-Diisopropyl-1-{[4-(3-methyl-5-sulfamoyl-3H-[1,...)
Affinity DataKi:  15nM. Assay description: Inhibitory activity against human carbonic anhydrase I (CA1)
In DepthDetails ArticlePubMed