BDBM50085016 2-Benzyloxycarbonylamino-3-{2-[(S)-4-(2-guanidino-ethyl)-2,5-dioxo-imidazolidin-1-yl]-acetylamino}-propionic acid anion
SMILES NC(=N)NCCc1[nH]c(=O)n(CC(=O)NCC(NC(=O)OCc2ccccc2)C([O-])=O)c1O
InChI Key InChIKey=OJTOSPOSLIOGQD-UHFFFAOYSA-M
Data  2 IC50
  Tab Delimited (TSV)   2D SDfile   Computed 3D by Vconf -m prep SDfile
Find this compound or compounds like it in BindingDB:
Activity Spreadsheet -- Enzyme Inhibition Constant Data from BindingDB
Found 2 hits for monomerid = 50085016
TargetIntegrin alpha-V/beta-3(Homo sapiens (Human))
Hoechst Marion Roussel
Curated by ChEMBL
LigandPNGBDBM50085016(2-Benzyloxycarbonylamino-3-{2-[(S)-4-(2-guanidino-...)
Affinity DataIC50:  5.00E+3nM. Assay description: Inhibition of Kistrin binding to integrin alphaV-beta3
In DepthDetails ArticlePubMed
TargetIntegrin alpha-IIb/beta-3(Homo sapiens (Human))
Hoechst Marion Roussel
Curated by ChEMBL
LigandPNGBDBM50085016(2-Benzyloxycarbonylamino-3-{2-[(S)-4-(2-guanidino-...)
Affinity DataIC50:  1.00E+4nM. Assay description: Inhibition of fibrinogen binding to integrin alphaIIb-beta3
In DepthDetails ArticlePubMed