BDBM50085162 2-{Cyclohexyl-[6-(quinolin-2-ylmethoxy)-benzo[b]thiophen-2-yl]-methoxyimino}-propionic acid::CHEMBL164251
SMILES C\C(=N/OC(C1CCCCC1)c1cc2ccc(OCc3ccc4ccccc4n3)cc2s1)C(O)=O
InChI Key InChIKey=MBNCFBMQPQMMSI-UXHLAJHPSA-N
Data  1 IC50
  Tab Delimited (TSV)   2D SDfile   Computed 3D by Vconf -m prep SDfile
Find this compound or compounds like it in BindingDB:
Activity Spreadsheet -- Enzyme Inhibition Constant Data from BindingDB
Found 1 hit for monomerid = 50085162
TargetPolyunsaturated fatty acid 5-lipoxygenase(Homo sapiens (Human))
Abbott Laboratories
Curated by ChEMBL
LigandPNGBDBM50085162(2-{Cyclohexyl-[6-(quinolin-2-ylmethoxy)-benzo[b]th...)
Affinity DataIC50:  40nM. Assay description: Inhibition of calcium ionophore (A-23187)-stimulated LTB4 formation in human neutrophil assay
In DepthDetails ArticlePubMed