BDBM50085186 2-{[4-(Benzothiazol-2-ylmethoxy)-phenyl]-cyclohexyl-methoxyimino}-propionic acid (0.5H2O)::CHEMBL349253
SMILES C\C(=N/OC(C1CCCCC1)c1ccc(OCc2nc3ccccc3s2)cc1)C(O)=O
InChI Key InChIKey=SZFQFDCSEAMMHM-WGOQTCKBSA-N
Data  1 IC50
  Tab Delimited (TSV)   2D SDfile   Computed 3D by Vconf -m prep SDfile
Find this compound or compounds like it in BindingDB:
Activity Spreadsheet -- Enzyme Inhibition Constant Data from BindingDB
Found 1 hit for monomerid = 50085186
TargetPolyunsaturated fatty acid 5-lipoxygenase(Homo sapiens (Human))
Abbott Laboratories
Curated by ChEMBL
LigandPNGBDBM50085186(2-{[4-(Benzothiazol-2-ylmethoxy)-phenyl]-cyclohexy...)
Affinity DataIC50:  60nM. Assay description: Inhibition of calcium ionophore (A-23187)-stimulated LTB4 formation in human neutrophil assay
In DepthDetails ArticlePubMed