BDBM50085201 2-{[2-Chloro-4-(5-fluoro-benzothiazol-2-ylmethoxy)-phenyl]-cyclohexyl-methoxyimino}-propionic acid::CHEMBL158767
SMILES C\C(=N/OC(C1CCCCC1)c1ccc(OCc2nc3cc(F)ccc3s2)cc1Cl)C(O)=O
InChI Key InChIKey=ZVUPSLXHYQIUND-CCVNUDIWSA-N
Data  1 IC50
  Tab Delimited (TSV)   2D SDfile   Computed 3D by Vconf -m prep SDfile
Find this compound or compounds like it in BindingDB:
Activity Spreadsheet -- Enzyme Inhibition Constant Data from BindingDB
Found 1 hit for monomerid = 50085201
TargetPolyunsaturated fatty acid 5-lipoxygenase(Homo sapiens (Human))
Abbott Laboratories
Curated by ChEMBL
LigandPNGBDBM50085201(2-{[2-Chloro-4-(5-fluoro-benzothiazol-2-ylmethoxy)...)
Affinity DataIC50:  48nM. Assay description: Inhibition of calcium ionophore (A-23187)-stimulated LTB4 formation in human neutrophil assay
In DepthDetails ArticlePubMed