BDBM50085330 4-Dipropylamino-cyclohex-1-enecarbonitrile::CHEMBL164631
SMILES CCCN(CCC)C1CCC(=CC1)C#N
InChI Key InChIKey=WKFNOWSGTCBYBL-UHFFFAOYSA-N
Data  5 KI
  Tab Delimited (TSV)   2D SDfile   Computed 3D by Vconf -m prep SDfile
Find this compound or compounds like it in BindingDB:
Activity Spreadsheet -- Enzyme Inhibition Constant Data from BindingDB
Found 5 hits for monomerid = 50085330
TargetD(3) dopamine receptor(Homo sapiens (Human))
Friedrich-Alexander University
Curated by ChEMBL
LigandPNGBDBM50085330(4-Dipropylamino-cyclohex-1-enecarbonitrile | CHEMB...)
Affinity DataKi:  1.30E+4nM. Assay description: Binding Affinity was tested on the high affinity site of Dopamine receptor D3
In DepthDetails ArticlePubMed
TargetD(1A) dopamine receptor(BOVINE)
Friedrich-Alexander University
Curated by ChEMBL
LigandPNGBDBM50085330(4-Dipropylamino-cyclohex-1-enecarbonitrile | CHEMB...)
Affinity DataKi: >2.00E+4nM. Assay description: Binding Affinity was tested on High Affinity Site of Bovine dopamine receptor D1. Tested for ability to displace the radioligand [3H]-SCH- 23390
In DepthDetails ArticlePubMed
TargetD(2) dopamine receptor(Homo sapiens (Human))
Friedrich-Alexander University
Curated by ChEMBL
LigandPNGBDBM50085330(4-Dipropylamino-cyclohex-1-enecarbonitrile | CHEMB...)
Affinity DataKi: >2.00E+4nM. Assay description: Binding Affinity on High Affinity Site of Dopamine receptor D2S
In DepthDetails ArticlePubMed
TargetD(2) dopamine receptor(Homo sapiens (Human))
Friedrich-Alexander University
Curated by ChEMBL
LigandPNGBDBM50085330(4-Dipropylamino-cyclohex-1-enecarbonitrile | CHEMB...)
Affinity DataKi: >2.00E+4nM. Assay description: Binding affinity on High Affinity Site of Dopamine receptor D2L
In DepthDetails ArticlePubMed
TargetD(4) dopamine receptor(Homo sapiens (Human))
Friedrich-Alexander University
Curated by ChEMBL
LigandPNGBDBM50085330(4-Dipropylamino-cyclohex-1-enecarbonitrile | CHEMB...)
Affinity DataKi: >2.00E+4nM. Assay description: Binding Affinity was tested on the high affinity site of Dopamine receptor D4.4
In DepthDetails ArticlePubMed