BDBM50085686 2-benzylamino(thioxo)methylhydrazinebenzoic acid::CHEMBL163840
SMILES OC(=O)c1ccccc1NNC(=S)NCc1ccccc1
InChI Key InChIKey=IECXDDIZDFLIDS-UHFFFAOYSA-N
Data  1 KI
  Tab Delimited (TSV)   2D SDfile   Computed 3D by Vconf -m prep SDfile
Find this compound or compounds like it in BindingDB:
Activity Spreadsheet -- Enzyme Inhibition Constant Data from BindingDB
Found 1 hit for monomerid = 50085686
TargetB2 bradykinin receptor(RAT)
Novartis Institute For Medical Sciences
Curated by ChEMBL
LigandPNGBDBM50085686(2-benzylamino(thioxo)methylhydrazinebenzoic acid |...)
Affinity DataKi: >1.00E+5nM. Assay description: Inhibition of binding of [3H]-BK to rat bradykinin B2 receptor expressed in NG108-15 neuroblastoma-glioma hybrid cell membranes
In DepthDetails ArticlePubMed