BDBM50085689 1N-benzyl-4-benzylamino(thioxo)methylhydrazine-3-nitro-1-benzenesulfonamide::CHEMBL164848
SMILES [O-][N+](=O)c1cc(ccc1N[N-]C(=[SH+])NCc1ccccc1)S(=O)(=O)NCc1ccccc1
InChI Key InChIKey=GHGRXPKZAXAJFP-UHFFFAOYSA-N
Data  1 KI
  Tab Delimited (TSV)   2D SDfile   Computed 3D by Vconf -m prep SDfile
Find this compound or compounds like it in BindingDB:
Activity Spreadsheet -- Enzyme Inhibition Constant Data from BindingDB
Found 1 hit for monomerid = 50085689
TargetB2 bradykinin receptor(RAT)
Novartis Institute For Medical Sciences
Curated by ChEMBL
LigandPNGBDBM50085689(1N-benzyl-4-benzylamino(thioxo)methylhydrazine-3-n...)
Affinity DataKi:  310nM. Assay description: Inhibition of binding of [3H]-BK to rat bradykinin B2 receptor expressed in NG108-15 neuroblastoma-glioma hybrid cell membranes
In DepthDetails ArticlePubMed