BDBM50085730 CHEMBL407074::Cyclo (4-10) [Ac-D Nal, D Fpa, D Trp, Asp, Glu, D Arg, Leu, Lys, Pro, Dpr]GnRH
SMILES CC[C@H](NC(C)=O)C(=O)N[C@@H](Cc1ccc(F)cc1)C(=O)N[C@@H](Cc1c[nH]c2ccccc12)C(=O)N[C@H]1CC(=O)NCC(NC(=O)[C@@H]2CCCN2C(=O)[C@@H](CCCCN)NC(=O)[C@H](CC(C)C)NC(=O)[C@@H](CCCNC(N)=N)NC(=O)[C@H](CCC(O)=O)NC1=O)C(N)=O
InChI Key InChIKey=DXBYLEFXVLWFIB-ZUQRYCASSA-N
Data  1 KI
  Tab Delimited (TSV)   2D SDfile   Computed 3D by Vconf -m prep SDfile
Find this compound or compounds like it in BindingDB:
Activity Spreadsheet -- Enzyme Inhibition Constant Data from BindingDB
Found 1 hit for monomerid = 50085730
TargetGonadotropin-releasing hormone receptor(Rattus norvegicus)
Salk Institute
Curated by ChEMBL
LigandPNGBDBM50085730(CHEMBL407074 | Cyclo (4-10) [Ac-D Nal, D Fpa, D Tr...)
Affinity DataKi:  0.360nM. Assay description: Competitive radioligand binding assay, in human HEK-293 cells stably transfected with the rat Gonadotropin-releasing hormone receptor
In DepthDetails ArticlePubMed