BDBM50085821 CHEMBL168427::Phosphoric acid mono-[4-(6-methylamino-purin-9-yl)-1-phosphonooxymethyl-bicyclo[3.1.0]hex-2-yl] ester
SMILES CNc1ncnc2n(cnc12)C1CC(OP(O)(O)=O)C2(COP(O)(O)=O)CC12
InChI Key InChIKey=FQABQZAJQNHBSV-UHFFFAOYSA-N
Data  1 IC50
  Tab Delimited (TSV)   2D SDfile   Computed 3D by Vconf -m prep SDfile
Find this compound or compounds like it in BindingDB:
Activity Spreadsheet -- Enzyme Inhibition Constant Data from BindingDB
Found 1 hit for monomerid = 50085821
TargetP2Y purinoceptor 1(Meleagris gallopavo)
National Institute Of Diabetes
Curated by ChEMBL
LigandPNGBDBM50085821(CHEMBL168427 | Phosphoric acid mono-[4-(6-methylam...)
Affinity DataIC50:  157nM. Assay description: Inhibition of 30 nM 2-MeSADP stimulation of 2PY1-mediated phospholipase C (PLC) activity in Turkey erythocyte ghosts
In DepthDetails ArticlePubMed