BDBM50085973 CHEMBL7580::Dimethyl-[2-(2-methyl-1H-indol-3-yl)-ethyl]-amine (HCl)
SMILES CN(C)CCc1c(C)[nH]c2ccccc12
InChI Key InChIKey=NDGCOWDSLVNLGE-UHFFFAOYSA-N
Data  1 KI
  Tab Delimited (TSV)   2D SDfile   Computed 3D by Vconf -m prep SDfile
Find this compound or compounds like it in BindingDB:
Activity Spreadsheet -- Enzyme Inhibition Constant Data from BindingDB
Found 1 hit for monomerid = 50085973
Target5-hydroxytryptamine receptor 6(Homo sapiens (Human))
Virginia Commonwealth University
Curated by ChEMBL
LigandPNGBDBM50085973(CHEMBL7580 | Dimethyl-[2-(2-methyl-1H-indol-3-yl)-...)
Affinity DataKi:  300nM. Assay description: Binding affinity for human 5-hydroxytryptamine 6 receptor expressed in HEK 293 human embryonic kidney cells, [3H]-lysergic acid diethylamide as radio...
In DepthDetails ArticlePubMed