BDBM50086087 1-(3-Methyl-2-phenyl-butyryl)-piperidine-2-carboxylic acid 1-(3-carboxymethoxy-phenyl)-3-(3,4-dimethoxy-phenyl)-propyl ester::CHEMBL278890
SMILES COc1ccc(CCC(OC(=O)[C@@H]2CCCCN2C(=O)[C@H](C(C)C)c2ccccc2)c2cccc(OCC(O)=O)c2)cc1OC
InChI Key InChIKey=LCRNDTPQUQXLMU-LDOMJKSJSA-N
Data  1 IC50
  Tab Delimited (TSV)   2D SDfile   Computed 3D by Vconf -m prep SDfile
Find this compound or compounds like it in BindingDB:
Activity Spreadsheet -- Enzyme Inhibition Constant Data from BindingDB
Found 1 hit for monomerid = 50086087
TargetPeptidyl-prolyl cis-trans isomerase FKBP1A(Homo sapiens (Human))
Ariad Gene Therapeutics
Curated by ChEMBL
LigandPNGBDBM50086087(1-(3-Methyl-2-phenyl-butyryl)-piperidine-2-carboxy...)
Affinity DataIC50:  19nM. Assay description: Binding affinity for Mutant F36V-FK506 binding protein by competitive assay based on fluorescence polarization.
In DepthDetails ArticlePubMed