BDBM50086099 4-(4-Fluoro-1H-indol-3-yl)-piperidine-1-carboxylic acid [4-methoxy-3-(4-methyl-piperazin-1-yl)-phenyl]-amide::CHEMBL15961
SMILES COc1ccc(NC(=O)N2CCC(CC2)c2c[nH]c3cccc(F)c23)cc1N1CCN(C)CC1
InChI Key InChIKey=GFTOBRDTIUVBRH-UHFFFAOYSA-N
Data  3 IC50
  Tab Delimited (TSV)   2D SDfile   Computed 3D by Vconf -m prep SDfile
Find this compound or compounds like it in BindingDB:
Activity Spreadsheet -- Enzyme Inhibition Constant Data from BindingDB
Found 3 hits for monomerid = 50086099
Target5-hydroxytryptamine receptor 1D(RAT)
Merck
Curated by ChEMBL
LigandPNGBDBM50086099(4-(4-Fluoro-1H-indol-3-yl)-piperidine-1-carboxylic...)
Affinity DataIC50:  300nM. Assay description: Binding affinity towards 5-hydroxytryptamine 1D receptor in rat frontal cortex using [125I]-iodocyanopindolol as radio-ligand.
In DepthDetails ArticlePubMed
Target5-hydroxytryptamine receptor 1A(Rattus norvegicus (rat))
Merck
Curated by ChEMBL
LigandPNGBDBM50086099(4-(4-Fluoro-1H-indol-3-yl)-piperidine-1-carboxylic...)
Affinity DataIC50:  300nM. Assay description: Binding affinity towards 5-hydroxytryptamine 1A receptor in rat frontal cortex using [125I]-iodocyanopindolol as radio-ligand.
In DepthDetails ArticlePubMed
Target5-hydroxytryptamine receptor 1B(Rattus norvegicus (Rat))
Merck
Curated by ChEMBL
LigandPNGBDBM50086099(4-(4-Fluoro-1H-indol-3-yl)-piperidine-1-carboxylic...)
Affinity DataIC50:  50nM. Assay description: Binding affinity towards 5-hydroxytryptamine 1B receptor in rat frontal cortex using [125I]-iodocyanopindolol as radio-ligand.
In DepthDetails ArticlePubMed