BDBM50086226 CHEMBL3425728
SMILES Cc1ccc(c(C)c1)-n1cc(O)c(=O)cc1CO
InChI Key InChIKey=MRXSKHROSOGKBR-UHFFFAOYSA-N
Data  1 IC50
  Tab Delimited (TSV)   2D SDfile   Computed 3D by Vconf -m prep SDfile
Find this compound or compounds like it in BindingDB:
Activity Spreadsheet -- Enzyme Inhibition Constant Data from BindingDB
Found 1 hit for monomerid = 50086226
TargetCatechol O-methyltransferase(Homo sapiens (Human))
Merck Research Laboratories
Curated by ChEMBL
LigandPNGBDBM50086226(CHEMBL3425728)
Affinity DataIC50:  5.80E+3nM. Assay description: Inhibition of C-terminal His6-tagged recombinant human membrane bound COMT expressed in Bacmid infected Sf-9 insect cells using dopamine/SAM as subst...
In DepthDetails ArticlePubMed