BDBM50086234 CHEMBL3425721
SMILES Oc1cn-2c(CSc3ccccc-23)cc1=O
InChI Key InChIKey=OWZYZCOWSAQTJY-UHFFFAOYSA-N
Data  1 IC50
  Tab Delimited (TSV)   2D SDfile   Computed 3D by Vconf -m prep SDfile
Find this compound or compounds like it in BindingDB:
Activity Spreadsheet -- Enzyme Inhibition Constant Data from BindingDB
Found 1 hit for monomerid = 50086234
TargetCatechol O-methyltransferase(Homo sapiens (Human))
Merck Research Laboratories
Curated by ChEMBL
LigandPNGBDBM50086234(CHEMBL3425721)
Affinity DataIC50:  400nM. Assay description: Inhibition of C-terminal His6-tagged recombinant human membrane bound COMT expressed in Bacmid infected Sf-9 insect cells using dopamine/SAM as subst...
In DepthDetails ArticlePubMed