BDBM50086465 (R)-3-(3-Acetimidoylamino-propylsulfanyl)-2-amino-propionic acid::CHEMBL158297
SMILES CC(=N)NCCCSC[C@H](N)C(O)=O
InChI Key InChIKey=RGJDUKGVWOHYLR-ZETCQYMHSA-N
Data  3 IC50
  Tab Delimited (TSV)   2D SDfile   Computed 3D by Vconf -m prep SDfile
Find this compound or compounds like it in BindingDB:
Activity Spreadsheet -- Enzyme Inhibition Constant Data from BindingDB
Found 3 hits for monomerid = 50086465
TargetNitric oxide synthase, endothelial(Homo sapiens (Human))
Glaxo Wellcome Research And Development
Curated by ChEMBL
LigandPNGBDBM50086465((R)-3-(3-Acetimidoylamino-propylsulfanyl)-2-amino-...)
Affinity DataIC50: >1.00E+5nM. Assay description: Inhibition of human endothelial Nitric Oxide Synthase
In DepthDetails ArticlePubMed
TargetNitric oxide synthase, brain(Homo sapiens (Human))
Glaxo Wellcome Research And Development
Curated by ChEMBL
LigandPNGBDBM50086465((R)-3-(3-Acetimidoylamino-propylsulfanyl)-2-amino-...)
Affinity DataIC50: >1.00E+5nM. Assay description: Inhibition of human neuronal Nitric Oxide Synthase
In DepthDetails ArticlePubMed
TargetNitric oxide synthase, inducible(Homo sapiens (Human))
Glaxo Wellcome Research And Development
Curated by ChEMBL
LigandPNGBDBM50086465((R)-3-(3-Acetimidoylamino-propylsulfanyl)-2-amino-...)
Affinity DataIC50:  6.20E+4nM. Assay description: Inhibition of human inducible nitric oxide synthase
In DepthDetails ArticlePubMed