BDBM50086519 8-Fluoro-2,2-dimethyl-6-trifluoromethyl-1,2,3,4-tetrahydro-pyrido[3,2-g]quinoline::CHEMBL133503
SMILES CC1(C)CCc2cc3c(cc(F)nc3cc2N1)C(F)(F)F
InChI Key InChIKey=LXRMNURTZNEDTF-UHFFFAOYSA-N
Data  1 KI  1 IC50
  Tab Delimited (TSV)   2D SDfile   Computed 3D by Vconf -m prep SDfile
Find this compound or compounds like it in BindingDB:
Activity Spreadsheet -- Enzyme Inhibition Constant Data from BindingDB
Found 2 hits for monomerid = 50086519
TargetAndrogen receptor(Homo sapiens (Human))
Ligand Pharmaceuticals
Curated by ChEMBL
LigandPNGBDBM50086519(8-Fluoro-2,2-dimethyl-6-trifluoromethyl-1,2,3,4-te...)
Affinity DataKi:  11nM. Assay description: Binding affinity for human androgen receptor transfected into mammalian COS-1 cells
In DepthDetails ArticlePubMed
TargetAndrogen receptor(Homo sapiens (Human))
Ligand Pharmaceuticals
Curated by ChEMBL
LigandPNGBDBM50086519(8-Fluoro-2,2-dimethyl-6-trifluoromethyl-1,2,3,4-te...)
Affinity DataIC50:  22nM. Assay description: Inhibitory concentration against human androgen receptor (AR) dependent transcriptional activity in cotransfected mammalian CV-1 cells
In DepthDetails ArticlePubMed