BDBM50086675 8-{3-[4-(4-Fluoro-benzoyl)-piperazin-1-yl]-2-hydroxy-propoxy}-4H-benzo[1,4]thiazin-3-one::CHEMBL142496
SMILES OC(COc1cccc2NC(=O)CSc12)CN1CCN(CC1)C(=O)c1ccc(F)cc1
InChI Key InChIKey=HGLMWLKCPYICHB-UHFFFAOYSA-N
Data  4 KI
  Tab Delimited (TSV)   2D SDfile   Computed 3D by Vconf -m prep SDfile
Find this compound or compounds like it in BindingDB:
Activity Spreadsheet -- Enzyme Inhibition Constant Data from BindingDB
Found 4 hits for monomerid = 50086675
TargetBeta-1 adrenergic receptor(Rattus norvegicus (Rat))
Università
Curated by ChEMBL
LigandPNGBDBM50086675(8-{3-[4-(4-Fluoro-benzoyl)-piperazin-1-yl]-2-hydro...)
Affinity DataKi: >1.00E+3nM. Assay description: Beta-1 adrenergic receptor binding affinity by measuring the displacement of [3H]-dihydroalprenolol binding in rat heart ; Not Active means Ki >1000 ...
In DepthDetails ArticlePubMed
LigandPNGBDBM50086675(8-{3-[4-(4-Fluoro-benzoyl)-piperazin-1-yl]-2-hydro...)
Affinity DataKi: >1.00E+3nM. Assay description: Alpha-2 adrenergic receptor binding affinity by measuring the displacement of [3H]clonidine binding in rat cerebral cortex; Not Active means Ki >1000...
In DepthDetails ArticlePubMed
TargetAlpha-1A/Alpha-1B/Alpha-1D adrenergic receptor(Rattus norvegicus (rat))
Università
Curated by ChEMBL
LigandPNGBDBM50086675(8-{3-[4-(4-Fluoro-benzoyl)-piperazin-1-yl]-2-hydro...)
Affinity DataKi: >1.00E+3nM. Assay description: Alpha-1 adrenergic receptor binding affinity by measuring the displacement of [3H]-prazosin binding in rat brain; Not Active means Ki >1000 nM
In DepthDetails ArticlePubMed
TargetBeta-2 adrenergic receptor(Canis familiaris)
Università
Curated by ChEMBL
LigandPNGBDBM50086675(8-{3-[4-(4-Fluoro-benzoyl)-piperazin-1-yl]-2-hydro...)
Affinity DataKi: >1.00E+3nM. Assay description: Beta-2 adrenergic receptor binding affinity by measuring the displacement of [3H]-DHA binding in rat lung; Not Active means Ki >1000 nM
In DepthDetails ArticlePubMed