BDBM50086742 CHEMBL3426377
SMILES NS(=O)(=O)c1ccccc1-c1ccc2[nH]c(CCc3ccc(cc3)C(F)(F)F)nc2c1
InChI Key InChIKey=BYXNUXUMQOLVTB-UHFFFAOYSA-N
Data  1 IC50
  Tab Delimited (TSV)   2D SDfile   Computed 3D by Vconf -m prep SDfile
Find this compound or compounds like it in BindingDB:
Activity Spreadsheet -- Enzyme Inhibition Constant Data from BindingDB
Found 1 hit for monomerid = 50086742
LigandPNGBDBM50086742(CHEMBL3426377)
Affinity DataIC50:  6nM. Assay description: Antagonist activity at recombinant human TRPV1 expressed in HEK293 cells assessed as inhibition of capsaicin-induced Ca2+ influx preincubated for 5 m...
In DepthDetails ArticlePubMed