BDBM50086937 2-{4'-[5-Methyl-2-(4-trifluoromethyl-phenyl)-oxazol-4-yl]-biphenyl-4-yloxy}-3-phenyl-propionic acid::CHEMBL25881
SMILES Cc1oc(nc1-c1ccc(cc1)-c1ccc(OC(Cc2ccccc2)C(O)=O)cc1)-c1ccc(cc1)C(F)(F)F
InChI Key InChIKey=COGNYBZZFHGBOC-UHFFFAOYSA-N
Data  1 IC50
  Tab Delimited (TSV)   2D SDfile   Computed 3D by Vconf -m prep SDfile
Find this compound or compounds like it in BindingDB:
Activity Spreadsheet -- Enzyme Inhibition Constant Data from BindingDB
Found 1 hit for monomerid = 50086937
TargetTyrosine-protein phosphatase non-receptor type 1(Homo sapiens (Human))
Wyeth-Ayerst Research
Curated by ChEMBL
LigandPNGBDBM50086937(2-{4'-[5-Methyl-2-(4-trifluoromethyl-phenyl)-oxazo...)
Affinity DataIC50:  1.30E+3nM. Assay description: In vitro inhibitory activity against human recombinant protein tyrosine phosphatase 1b (PTP1B)
In DepthDetails ArticlePubMed