BDBM50087101 1-{[3-Biphenyl-4-yl-2-(1-carboxy-propylcarbamoyl)-propyl]-hydroxy-phosphinoyl}-2-phenyl-ethyl-ammonium
SMILES CC[C@H](NC(=O)[C@H](Cc1ccc(cc1)-c1ccccc1)CP(O)(=O)C([NH3+])Cc1ccccc1)C(O)=O
InChI Key InChIKey=RPGUTKQPLJSELM-DUGVZXTISA-O
Data  2 KI
  Tab Delimited (TSV)   2D SDfile   Computed 3D by Vconf -m prep SDfile
Find this compound or compounds like it in BindingDB:
Activity Spreadsheet -- Enzyme Inhibition Constant Data from BindingDB
Found 2 hits for monomerid = 50087101
TargetNeprilysin(Oryctolagus cuniculus (rabbit))
University Of Paris
Curated by ChEMBL
LigandPNGBDBM50087101(1-{[3-Biphenyl-4-yl-2-(1-carboxy-propylcarbamoyl)-...)
Affinity DataKi:  3.30nM. Assay description: Inhibitory activity on neutral endopeptidase (NEP) using DGNPA as substrate.
In DepthDetails ArticlePubMed
TargetAminopeptidase N(Sus scrofa (Pig))
University Of Paris
Curated by ChEMBL
LigandPNGBDBM50087101(1-{[3-Biphenyl-4-yl-2-(1-carboxy-propylcarbamoyl)-...)
Affinity DataKi:  33nM. Assay description: Inhibitory activity on aminopeptidase N (APN) using Ala-pNA as substrate.
In DepthDetails ArticlePubMed