BDBM50087108 1-{[2-(1-Carboxy-ethylcarbamoyl)-3-phenyl-propyl]-hydroxy-phosphinoyl}-2-phenyl-ethyl-ammonium
SMILES C[C@H](NC(=O)[C@H](Cc1ccccc1)CP(O)(=O)C([NH3+])Cc1ccccc1)C(O)=O
InChI Key InChIKey=DCCFKHXJJKUJCT-APBAKZIRSA-O
Data  2 KI
  Tab Delimited (TSV)   2D SDfile   Computed 3D by Vconf -m prep SDfile
Find this compound or compounds like it in BindingDB:
Activity Spreadsheet -- Enzyme Inhibition Constant Data from BindingDB
Found 2 hits for monomerid = 50087108
TargetAminopeptidase N(Sus scrofa (Pig))
University Of Paris
Curated by ChEMBL
LigandPNGBDBM50087108(1-{[2-(1-Carboxy-ethylcarbamoyl)-3-phenyl-propyl]-...)
Affinity DataKi:  17.3nM. Assay description: Inhibitory activity on aminopeptidase N (APN) using Ala-pNA as substrate.
In DepthDetails ArticlePubMed
TargetNeprilysin(Oryctolagus cuniculus (rabbit))
University Of Paris
Curated by ChEMBL
LigandPNGBDBM50087108(1-{[2-(1-Carboxy-ethylcarbamoyl)-3-phenyl-propyl]-...)
Affinity DataKi:  185nM. Assay description: Inhibitory activity on neutral endopeptidase (NEP) using DGNPA as substrate.
In DepthDetails ArticlePubMed