BDBM50087120 (S,S,S)1-{[2-(1-Carboxy-2-phenyl-ethylcarbamoyl)-4-methyl-pentyl]-hydroxy-phosphinoyl}-2-phenyl-ethyl-ammonium
SMILES CC(C)C[C@H](CP(O)(=O)[C@@H]([NH3+])Cc1ccccc1)C(=O)N[C@@H](Cc1ccccc1)C(O)=O
InChI Key InChIKey=LODXGPQGMCHDQW-BHIFYINESA-O
Data  2 KI
  Tab Delimited (TSV)   2D SDfile   Computed 3D by Vconf -m prep SDfile
Find this compound or compounds like it in BindingDB:
Activity Spreadsheet -- Enzyme Inhibition Constant Data from BindingDB
Found 2 hits for monomerid = 50087120
TargetAminopeptidase N(Sus scrofa (Pig))
University Of Paris
Curated by ChEMBL
LigandPNGBDBM50087120((S,S,S)1-{[2-(1-Carboxy-2-phenyl-ethylcarbamoyl)-4...)
Affinity DataKi:  32nM. Assay description: Inhibitory activity on aminopeptidase N (APN) using Ala-pNA as substrate.
In DepthDetails ArticlePubMed
TargetNeprilysin(Oryctolagus cuniculus (rabbit))
University Of Paris
Curated by ChEMBL
LigandPNGBDBM50087120((S,S,S)1-{[2-(1-Carboxy-2-phenyl-ethylcarbamoyl)-4...)
Affinity DataKi:  140nM. Assay description: Inhibitory activity on neutral endopeptidase (NEP) using DGNPA as substrate.
In DepthDetails ArticlePubMed