BDBM50087149 1N-{8-[2-hydroxy-(1R,2S,4aR,13bS,14aS)-1,2,3,4,4a,5,7,8,13,13b,14,14a-dodecahydroisoquino[3,2-a]b-carbolin-1-ylcarboxamido]octyl}-2-hydroxy-(1R,2S,4aR,13bS,14aS)-1,2,3,4,4a,5,7,8,13,13b,14,14a-dodecahydroisoquino[3,2 ; dihydrochloride::CHEMBL538808
SMILES O[C@H]1CC[C@H]2CN3CCc4c([nH]c5ccccc45)[C@@H]3C[C@@H]2[C@H]1C(=O)NCCCCCCCCNC(=O)[C@H]1[C@@H](O)CC[C@H]2CN3CCc4c([nH]c5ccccc45)[C@@H]3C[C@H]12
InChI Key InChIKey=PRNVEOXPKRXUQW-XDMILYRNSA-N
Data  2 KI
  Tab Delimited (TSV)   2D SDfile   Computed 3D by Vconf -m prep SDfile
Find this compound or compounds like it in BindingDB:
Activity Spreadsheet -- Enzyme Inhibition Constant Data from BindingDB
Found 2 hits for monomerid = 50087149
TargetAlpha-2A adrenergic receptor(Homo sapiens (Human))
University Of Tennessee
Curated by ChEMBL
LigandPNGBDBM50087149(1N-{8-[2-hydroxy-(1R,2S,4aR,13bS,14aS)-1,2,3,4,4a,...)
Affinity DataKi:  0.760nM. Assay description: Binding affinity against human Alpha-2A adrenergic receptor expressed stably in CHO cells using [3H]rauwolscine as radioligand
In DepthDetails ArticlePubMed
TargetAlpha-2B adrenergic receptor(Homo sapiens (Human))
University Of Tennessee
Curated by ChEMBL
LigandPNGBDBM50087149(1N-{8-[2-hydroxy-(1R,2S,4aR,13bS,14aS)-1,2,3,4,4a,...)
Affinity DataKi:  46nM. Assay description: Binding affinity against human alpha 2b-adrenergic receptor expressed stably in CHO cells using [3H]rauwolscine as radioligand
In DepthDetails ArticlePubMed