BDBM50088013 2-[11-[2-(2-methoxyphenyl)acetyl]-1-phenyl-(1R,8R,9S,13S)-11-azatetracyclo[6.5.2.02,7.09,13]pentadeca-2,4,6-trien-9-ylcarboxamido]acetic acid (RPR113258)::CHEMBL300028
SMILES COc1ccccc1CC(=O)N1C[C@@H]2[C@](C1)([C@@H]1CC[C@@]2(c2ccccc2)c2ccccc12)C(=O)NCC(O)=O
InChI Key InChIKey=PNJYHSDVQYUDQU-QIDXQZPBSA-N
Data  1 KI
  Tab Delimited (TSV)   2D SDfile   Computed 3D by Vconf -m prep SDfile
Find this compound or compounds like it in BindingDB:
Activity Spreadsheet -- Enzyme Inhibition Constant Data from BindingDB
Found 1 hit for monomerid = 50088013
TargetDimer of Protein farnesyltransferase subunit beta(Homo sapiens (Human))
RhôNe-Poulenc Rorer
Curated by ChEMBL
LigandPNGBDBM50088013(2-[11-[2-(2-methoxyphenyl)acetyl]-1-phenyl-(1R,8R,...)
Affinity DataKi:  738nM. Assay description: Inhibition of farnesyltransferase by Ras/SPA assay
In DepthDetails ArticlePubMed