BDBM50088217 CHEMBL58095::E-2-Amino-4-(3-phenyl-allyl)-pentanedioic acid
SMILES N[C@@H](C[C@@H](C\C=C\c1ccccc1)C(O)=O)C(O)=O
InChI Key InChIKey=TYAXDMDRDFQFHK-SQMDOARZSA-N
Data  2 KI
  Tab Delimited (TSV)   2D SDfile   Computed 3D by Vconf -m prep SDfile
Find this compound or compounds like it in BindingDB:
Activity Spreadsheet -- Enzyme Inhibition Constant Data from BindingDB
Found 2 hits for monomerid = 50088217
TargetGlutamate receptor ionotropic, kainate 1(Homo sapiens (Human))
Eli Lilly
Curated by ChEMBL
LigandPNGBDBM50088217(CHEMBL58095 | E-2-Amino-4-(3-phenyl-allyl)-pentane...)
Affinity DataKi:  44nM. Assay description: Binding affinity against human ionotropic glutamate receptor kainate 1 in HK293 cells using [3H]-kainate as radioligand
In DepthDetails ArticlePubMed
TargetGlutamate receptor ionotropic, kainate 2(Homo sapiens (Human))
Eli Lilly
Curated by ChEMBL
LigandPNGBDBM50088217(CHEMBL58095 | E-2-Amino-4-(3-phenyl-allyl)-pentane...)
Affinity DataKi:  1.58E+3nM. Assay description: Compound was tested for binding affinity against human Ionotropic glutamate receptor ionotropic kainate 2 in HEK293 cells using [3H]-kainate as radio...
In DepthDetails ArticlePubMed