BDBM50088224 CHEMBL305346::E-2-Amino-4-[3-(3-methoxy-phenyl)-allyl]-pentanedioic acid
SMILES COc1cccc(\C=C\C[C@H](C[C@H](N)C(O)=O)C(O)=O)c1
InChI Key InChIKey=VLNSKCZZXBILMA-JRHXIVCJSA-N
Data  2 KI
  Tab Delimited (TSV)   2D SDfile   Computed 3D by Vconf -m prep SDfile
Find this compound or compounds like it in BindingDB:
Activity Spreadsheet -- Enzyme Inhibition Constant Data from BindingDB
Found 2 hits for monomerid = 50088224
TargetGlutamate receptor ionotropic, kainate 1(Homo sapiens (Human))
Eli Lilly
Curated by ChEMBL
LigandPNGBDBM50088224(CHEMBL305346 | E-2-Amino-4-[3-(3-methoxy-phenyl)-a...)
Affinity DataKi:  40nM. Assay description: Binding affinity against human ionotropic glutamate receptor kainate 1 in HK293 cells using [3H]-kainate as radioligand
In DepthDetails ArticlePubMed
TargetGlutamate receptor ionotropic, kainate 2(Homo sapiens (Human))
Eli Lilly
Curated by ChEMBL
LigandPNGBDBM50088224(CHEMBL305346 | E-2-Amino-4-[3-(3-methoxy-phenyl)-a...)
Affinity DataKi:  6.35E+3nM. Assay description: Binding affinity against human ionotropic glutamate receptor ionotropic kainate 2 in HEK293 cells using [3H]-kainate as radioligand
In DepthDetails ArticlePubMed