BDBM50088386 Bunazosin::Bunazosin HCl
SMILES CCCC(=O)N1CCCN(CC1)c1nc(N)c2cc(OC)c(OC)cc2n1
InChI Key InChIKey=RHLJLALHBZGAFM-UHFFFAOYSA-N
Data  2 IC50
  Tab Delimited (TSV)   2D SDfile   Computed 3D by Vconf -m prep SDfile
Find this compound or compounds like it in BindingDB:
Activity Spreadsheet -- Enzyme Inhibition Constant Data from BindingDB
Found 2 hits for monomerid = 50088386
TargetAlpha-1A/Alpha-1B/Alpha-1D adrenergic receptor(Homo sapiens (Human))
Panjab University
Curated by ChEMBL
LigandPNGBDBM50088386(Bunazosin | Bunazosin HCl)
Affinity DataIC50:  1.20nM. Assay description: Antagonist activity at Adrenergic alpha-1 receptor (unknown origin)
In DepthDetails PubMed
TargetVoltage-dependent L-type calcium channel subunit alpha-1C(Cavia porcellus)
Jagiellonian University
Curated by ChEMBL
LigandPNGBDBM50088386(Bunazosin | Bunazosin HCl)
Affinity DataIC50:  6.00E+4nM. Assay description: Inhibition of L-type calcium channel measured using whole-cell patch clamp in guinea pig ventricular myocytes
In DepthDetails ArticlePubMed