BDBM50088457 1-(5-Methoxy-pyridin-3-yl)-[1,4]diazepane::1-(5-methoxypyridin-3-yl)-1,4-diazepane::CHEMBL71666
SMILES COc1cncc(c1)N1CCCNCC1
InChI Key InChIKey=CLRANNZHQRADST-UHFFFAOYSA-N
Data  1 IC50  1 EC50
  Tab Delimited (TSV)   2D SDfile   Computed 3D by Vconf -m prep SDfile
Find this compound or compounds like it in BindingDB:
Activity Spreadsheet -- Enzyme Inhibition Constant Data from BindingDB
Found 2 hits for monomerid = 50088457
TargetNeuronal acetylcholine receptor subunit alpha-4(Homo sapiens (Human))
University Of Turin
Curated by ChEMBL
LigandPNGBDBM50088457(1-(5-Methoxy-pyridin-3-yl)-[1,4]diazepane | 1-(5-m...)
Affinity DataEC50:  1.41E+3nM. Assay description: Agonist activity at human alpha4beta2 nAChR expressed in HEK293 cells assessed as intracellular calcium level by FLIPR assay
In DepthDetails ArticlePubMed
TargetNeuronal acetylcholine receptor subunit alpha-4(Homo sapiens (Human))
University Of Turin
Curated by ChEMBL
LigandPNGBDBM50088457(1-(5-Methoxy-pyridin-3-yl)-[1,4]diazepane | 1-(5-m...)
Affinity DataIC50:  1.91nM. Assay description: Displacement of [3H]cytisine from human alpha4beta2 nAChR expressed in HEK293 cells
In DepthDetails ArticlePubMed