BDBM50088642 3-Phenyl-5-((R)-pyrrolidin-3-yloxy)-pyridine::CHEMBL10563
SMILES C1C[C@H](CN1)Oc1cncc(c1)-c1ccccc1
InChI Key InChIKey=SGCDVZSPNVYMKM-CQSZACIVSA-N
Data  1 IC50
  Tab Delimited (TSV)   2D SDfile   Computed 3D by Vconf -m prep SDfile
Find this compound or compounds like it in BindingDB:
Activity Spreadsheet -- Enzyme Inhibition Constant Data from BindingDB
Found 1 hit for monomerid = 50088642
TargetNeuronal acetylcholine receptor subunit alpha-4/beta-2(Rattus norvegicus (Rat))
R. W. Johnson Pharmaceutical Research Institute
Curated by ChEMBL
LigandPNGBDBM50088642(3-Phenyl-5-((R)-pyrrolidin-3-yloxy)-pyridine | CHE...)
Affinity DataIC50:  1.82E+3nM. Assay description: Evaluated for binding affinity towards nicotinic acetylcholine receptor alpha4-beta2
In DepthDetails ArticlePubMed