BDBM50088654 CHEMBL273861::N-(6-Amino-2-methyl-pyridin-3-ylmethyl)-2-(6-methyl-2,8-dioxo-2,3,4,8-tetrahydro-1H-[1,7]naphthyridin-7-yl)-acetamide
SMILES Cc1cc2CCC(=O)Nc2c(=O)n1CC(=O)NCc1ccc(N)nc1C
InChI Key InChIKey=GZLSRIOJUOYOBV-UHFFFAOYSA-N
Data  2 KI
  Tab Delimited (TSV)   2D SDfile   Computed 3D by Vconf -m prep SDfile
Find this compound or compounds like it in BindingDB:
Activity Spreadsheet -- Enzyme Inhibition Constant Data from BindingDB
Found 2 hits for monomerid = 50088654
TargetProthrombin(Homo sapiens (Human))
Merck Research Laboratories
Curated by ChEMBL
LigandPNGBDBM50088654(CHEMBL273861 | N-(6-Amino-2-methyl-pyridin-3-ylmet...)
Affinity DataKi:  350nM. Assay description: The compound was tested for its ability to inhibit thrombin.
In DepthDetails ArticlePubMed
TargetSerine protease 1(Homo sapiens (Human))
Merck Research Laboratories
Curated by ChEMBL
LigandPNGBDBM50088654(CHEMBL273861 | N-(6-Amino-2-methyl-pyridin-3-ylmet...)
Affinity DataKi:  1.01E+5nM. Assay description: The compound was tested for its ability to inhibit trypsin.
In DepthDetails ArticlePubMed