BDBM50088871 2-(5,6-dihydro-4H-pyrrolo[3,2,1-ij]quinolin-1-yl)-1-ethanamine::CHEMBL171774
SMILES NCCc1cn2CCCc3cccc1c23
InChI Key InChIKey=SZZOKSZDRAYQNN-UHFFFAOYSA-N
Data  2 KI  2 EC50
  Tab Delimited (TSV)   2D SDfile   Computed 3D by Vconf -m prep SDfile
Find this compound or compounds like it in BindingDB:
Activity Spreadsheet -- Enzyme Inhibition Constant Data from BindingDB
Found 4 hits for monomerid = 50088871
Target5-hydroxytryptamine receptor 2C(Homo sapiens (Human))
Nps Allelix
Curated by ChEMBL
LigandPNGBDBM50088871(2-(5,6-dihydro-4H-pyrrolo[3,2,1-ij]quinolin-1-yl)-...)
Affinity DataKi:  41nM. Assay description: In vitro binding affinity of the compound towards human 5-hydroxytryptamine 2A receptor expressed in HEK-293 cells was determined using [3H]-ketanser...
In DepthDetails ArticlePubMed
Target5-hydroxytryptamine receptor 2A(Homo sapiens (Human))
Nps Allelix
Curated by ChEMBL
LigandPNGBDBM50088871(2-(5,6-dihydro-4H-pyrrolo[3,2,1-ij]quinolin-1-yl)-...)
Affinity DataKi:  794nM. Assay description: In vitro binding affinity of the compound towards human 5-hydroxytryptamine 2A receptor expressed in HEK-293 cells was determined using [3H]-ketanser...
In DepthDetails ArticlePubMed
Target5-hydroxytryptamine receptor 2C(Homo sapiens (Human))
Nps Allelix
Curated by ChEMBL
LigandPNGBDBM50088871(2-(5,6-dihydro-4H-pyrrolo[3,2,1-ij]quinolin-1-yl)-...)
Affinity DataEC50:  0.200nM. Assay description: Functional agonist activity of compound was determined by fluorescence-based assay measuring intra-cellular calcium mobilization for 5-HT2c receptor ...
In DepthDetails ArticlePubMed
Target5-hydroxytryptamine receptor 2A(Homo sapiens (Human))
Nps Allelix
Curated by ChEMBL
LigandPNGBDBM50088871(2-(5,6-dihydro-4H-pyrrolo[3,2,1-ij]quinolin-1-yl)-...)
Affinity DataEC50:  145nM. Assay description: Functional agonist activity of compound was determined by fluorescence-based assay measuring intra-cellular calcium mobilization for 5-HT2a receptor ...
In DepthDetails ArticlePubMed