BDBM50088930 3-{6-[3-amino(imino)methylbenzylamino]-1H-1-indolyl}phenyl-iminomethanamine::CHEMBL172147
SMILES NC(=N)c1cccc(CNc2ccc3ccn(-c4cccc(c4)C(N)=N)c3c2)c1
InChI Key InChIKey=GFYDZCWESBPIFI-UHFFFAOYSA-N
Data  3 KI
  Tab Delimited (TSV)   2D SDfile   Computed 3D by Vconf -m prep SDfile
Find this compound or compounds like it in BindingDB:
Activity Spreadsheet -- Enzyme Inhibition Constant Data from BindingDB
Found 3 hits for monomerid = 50088930
TargetCoagulation factor X(Homo sapiens (Human))
Berlex Biosciences
Curated by ChEMBL
LigandPNGBDBM50088930(3-{6-[3-amino(imino)methylbenzylamino]-1H-1-indoly...)
Affinity DataKi:  190nM. Assay description: In vitro inhibition of human Coagulation factor X.
In DepthDetails ArticlePubMed
TargetSerine protease 1(Homo sapiens (Human))
Berlex Biosciences
Curated by ChEMBL
LigandPNGBDBM50088930(3-{6-[3-amino(imino)methylbenzylamino]-1H-1-indoly...)
Affinity DataKi:  410nM. Assay description: In vitro inhibition of bovine trypsin.
In DepthDetails ArticlePubMed
TargetProthrombin(Homo sapiens (Human))
Berlex Biosciences
Curated by ChEMBL
LigandPNGBDBM50088930(3-{6-[3-amino(imino)methylbenzylamino]-1H-1-indoly...)
Affinity DataKi:  4.00E+3nM. Assay description: In vitro inhibition of human Coagulation factor II.
In DepthDetails ArticlePubMed