BDBM50089004 2,6-Dichloro-benzoic acid 4-{(S)-2-[((S)-3-acetyl-thiazolidine-4-carbonyl)-amino]-2-carboxy-ethyl}-phenyl ester::CHEMBL177833
SMILES CC(=O)N1CSC[C@@H]1C(=O)N[C@@H](Cc1ccc(OC(=O)c2c(Cl)cccc2Cl)cc1)C(O)=O
InChI Key InChIKey=RGGBJXQQHOWVSH-ZWKOTPCHSA-N
Data  2 IC50
  Tab Delimited (TSV)   2D SDfile   Computed 3D by Vconf -m prep SDfile
Find this compound or compounds like it in BindingDB:
Activity Spreadsheet -- Enzyme Inhibition Constant Data from BindingDB
Found 2 hits for monomerid = 50089004
TargetIntegrin alpha-4/beta-1(Homo sapiens (Human))
Celltech Chiroscience
Curated by ChEMBL
LigandPNGBDBM50089004(2,6-Dichloro-benzoic acid 4-{(S)-2-[((S)-3-acetyl-...)
Affinity DataIC50:  24nM. Assay description: Inhibition of alpha4-beta1 VCAM binding in Jurkat cell adhesion assay
In DepthDetails ArticlePubMed
TargetIntegrin alpha-4/beta-1(Homo sapiens (Human))
Celltech Chiroscience
Curated by ChEMBL
LigandPNGBDBM50089004(2,6-Dichloro-benzoic acid 4-{(S)-2-[((S)-3-acetyl-...)
Affinity DataIC50:  6nM. Assay description: Affinity for alpha4-beta1 integrin from HL60 cell lysate
In DepthDetails ArticlePubMed