BDBM50089057 CHEMBL429053::N*4*-Phenyl-N*2*-p-tolyl-quinazoline-2,4-diamine
SMILES Cc1ccc(Nc2nc(Nc3ccccc3)c3ccccc3n2)cc1
InChI Key InChIKey=NWPLLWWBPPYCDY-UHFFFAOYSA-N
Data  1 IC50
  Tab Delimited (TSV)   2D SDfile   Computed 3D by Vconf -m prep SDfile
Find this compound or compounds like it in BindingDB:
Activity Spreadsheet -- Enzyme Inhibition Constant Data from BindingDB
Found 1 hit for monomerid = 50089057
TargetNeuropeptide Y receptor type 5(Homo sapiens (Human))
Novartis Pharma
Curated by ChEMBL
LigandPNGBDBM50089057(CHEMBL429053 | N*4*-Phenyl-N*2*-p-tolyl-quinazolin...)
Affinity DataIC50:  200nM. Assay description: Antagonistic activity against neuropeptide Y receptor type 5 subtype stably expressed in LM(tk-)cells
In DepthDetails ArticlePubMed