BDBM50089164 (S)-7-((3R,5S,7aR)-5-Propyl-hexahydro-pyrrolizin-3-yl)-heptan-2-ol::CHEMBL284725
SMILES CCC[C@H]1CC[C@@H]2CC[C@@H](CCCCC[C@H](C)O)N12
InChI Key InChIKey=JLXFCRGBJHNVNU-MWDXBVQZSA-N
Data  1 KI
  Tab Delimited (TSV)   2D SDfile   Computed 3D by Vconf -m prep SDfile
Find this compound or compounds like it in BindingDB:
Activity Spreadsheet -- Enzyme Inhibition Constant Data from BindingDB
Found 1 hit for monomerid = 50089164
TargetAcetylcholine receptor subunit alpha/beta/delta/gamma(Torpedo californica)
Toyama Medical And Pharmaceutical University
Curated by ChEMBL
LigandPNGBDBM50089164((S)-7-((3R,5S,7aR)-5-Propyl-hexahydro-pyrrolizin-3...)
Affinity DataKi:  3.10E+6nM. Assay description: Compound was evaluated for inhibition of [3H]-TCP binding to Nicotinic acetylcholine receptor of Torpedo californica
In DepthDetails ArticlePubMed