BDBM50089196 3-Benzenesulfonyl-heptanoic acid hydroxyamide::CHEMBL263501
SMILES CCCCC(CC(=O)NO)S(=O)(=O)c1ccccc1
InChI Key InChIKey=TUUMURVUDGZZQZ-UHFFFAOYSA-N
Data  8 IC50
  Tab Delimited (TSV)   2D SDfile   Computed 3D by Vconf -m prep SDfile
Find this compound or compounds like it in BindingDB:
Activity Spreadsheet -- Enzyme Inhibition Constant Data from BindingDB
Found 8 hits for monomerid = 50089196
TargetNeprilysin(Rattus norvegicus (Rat))
F. Hoffmann-La Roche
Curated by ChEMBL
LigandPNGBDBM50089196(3-Benzenesulfonyl-heptanoic acid hydroxyamide | CH...)
Affinity DataIC50:  1.80E+4nM. Assay description: Inhibitory activity against neutral endopeptidase enzyme (NEP).
In DepthDetails ArticlePubMed
TargetInterstitial collagenase(Homo sapiens (Human))
F. Hoffmann-La Roche
Curated by ChEMBL
LigandPNGBDBM50089196(3-Benzenesulfonyl-heptanoic acid hydroxyamide | CH...)
Affinity DataIC50:  110nM. Assay description: Inhibition of Matrix metalloprotease-1
In DepthDetails ArticlePubMed
TargetEndothelin-converting enzyme 1(Homo sapiens (Human))
F. Hoffmann-La Roche
Curated by ChEMBL
LigandPNGBDBM50089196(3-Benzenesulfonyl-heptanoic acid hydroxyamide | CH...)
Affinity DataIC50: >5.00E+4nM. Assay description: Inhibitory activity against Endothelin-converting enzyme 1
In DepthDetails ArticlePubMed
TargetAngiotensin-converting enzyme(Homo sapiens (Human))
F. Hoffmann-La Roche
Curated by ChEMBL
LigandPNGBDBM50089196(3-Benzenesulfonyl-heptanoic acid hydroxyamide | CH...)
Affinity DataIC50:  8.10E+4nM. Assay description: Inhibitory activity against angiotensin I converting enzyme (ACE)
In DepthDetails ArticlePubMed
TargetCollagenase 3(Homo sapiens (Human))
F. Hoffmann-La Roche
Curated by ChEMBL
LigandPNGBDBM50089196(3-Benzenesulfonyl-heptanoic acid hydroxyamide | CH...)
Affinity DataIC50:  22nM. Assay description: Inhibition of Matrix metalloprotease-13
In DepthDetails ArticlePubMed
TargetMatrilysin(Homo sapiens (Human))
F. Hoffmann-La Roche
Curated by ChEMBL
LigandPNGBDBM50089196(3-Benzenesulfonyl-heptanoic acid hydroxyamide | CH...)
Affinity DataIC50:  1.10E+3nM. Assay description: Inhibition of matrilysin, Matrix metalloprotease-7
In DepthDetails ArticlePubMed
TargetMacrophage metalloelastase(Homo sapiens (Human))
F. Hoffmann-La Roche
Curated by ChEMBL
LigandPNGBDBM50089196(3-Benzenesulfonyl-heptanoic acid hydroxyamide | CH...)
Affinity DataIC50:  12nM. Assay description: Inhibition of human Matrix metalloprotease-12
In DepthDetails ArticlePubMed
TargetPeptide deformylase(Escherichia coli)
F. Hoffmann-La Roche
Curated by ChEMBL
LigandPNGBDBM50089196(3-Benzenesulfonyl-heptanoic acid hydroxyamide | CH...)
Affinity DataIC50:  35nM. Assay description: Inhibitory activity against isolated Escherichia coli peptidyl deformylase (PDF) enzyme containing iron.
In DepthDetails ArticlePubMed