BDBM50089200 3-(4-Bromo-benzenesulfonyl)-heptanoic acid hydroxyamide::CHEMBL76782
SMILES CCCCC(CC(=O)NO)S(=O)(=O)c1ccc(Br)cc1
InChI Key InChIKey=JKKBPRKOAWXEMP-UHFFFAOYSA-N
Data  1 IC50
  Tab Delimited (TSV)   2D SDfile   Computed 3D by Vconf -m prep SDfile
Find this compound or compounds like it in BindingDB:
Activity Spreadsheet -- Enzyme Inhibition Constant Data from BindingDB
Found 1 hit for monomerid = 50089200
TargetPeptide deformylase(Escherichia coli)
F. Hoffmann-La Roche
Curated by ChEMBL
LigandPNGBDBM50089200(3-(4-Bromo-benzenesulfonyl)-heptanoic acid hydroxy...)
Affinity DataIC50:  120nM. Assay description: Inhibitory activity against isolated Escherichia coli peptidyl deformylase (PDF) enzyme containing iron.
In DepthDetails ArticlePubMed