BDBM50089210 3-(4-Methoxy-benzenesulfinyl)-heptanoic acid hydroxyamide::CHEMBL77579
SMILES CCCCC(CC(=O)NO)S(=O)c1ccc(OC)cc1
InChI Key InChIKey=XRLJRQHJRLKTJB-UHFFFAOYSA-N
Data  1 IC50
  Tab Delimited (TSV)   2D SDfile   Computed 3D by Vconf -m prep SDfile
Find this compound or compounds like it in BindingDB:
Activity Spreadsheet -- Enzyme Inhibition Constant Data from BindingDB
Found 1 hit for monomerid = 50089210
TargetPeptide deformylase(Escherichia coli)
F. Hoffmann-La Roche
Curated by ChEMBL
LigandPNGBDBM50089210(3-(4-Methoxy-benzenesulfinyl)-heptanoic acid hydro...)
Affinity DataIC50:  99nM. Assay description: Inhibitory activity against isolated Escherichia coli peptidyl deformylase (PDF) enzyme containing iron.
In DepthDetails ArticlePubMed