BDBM50089322 CHEMBL3577920
SMILES COc1ncc(cc1NS(=O)(=O)c1ccc(cc1)C(F)(F)F)-c1cc2c(ncnc2s1)-c1ccncc1
InChI Key InChIKey=HBYZOWZFFQUABN-UHFFFAOYSA-N
Data  1 IC50
  Tab Delimited (TSV)   2D SDfile   Computed 3D by Vconf -m prep SDfile
Find this compound or compounds like it in BindingDB:
Activity Spreadsheet -- Enzyme Inhibition Constant Data from BindingDB
Found 1 hit for monomerid = 50089322
TargetPhosphatidylinositol 4,5-bisphosphate 3-kinase catalytic subunit alpha isoform(Homo sapiens (Human))
Pkucare Pharmaceutical R & D Center
Curated by ChEMBL
LigandPNGBDBM50089322(CHEMBL3577920)
Affinity DataIC50:  17nM. Assay description: Inhibition of PI3Kalpha (unknown origin) using PIP2/PS as substrate after 1 hr by luciferase-based luminescence assay
In DepthDetails ArticlePubMed