BDBM50089533 Actinomycin D analogue::CHEMBL2369547
SMILES [H][C@@]12CCCN1C(=O)[C@H](NC(=O)[C@@H](NC(=O)c1ccc(C)c3oc4c(C)c(=O)c(N)c(C(=O)N[C@H]5[C@@H](C)OC(=O)[C@@H](Cc6ccc(O)cc6)NC(=O)CN(C)C(=O)[C@]6([H])CCCN6C(=O)[C@H](NC5=O)C(C)C)c4nc13)[C@@H](C)OC(=O)[C@@H](Cc1ccc(O)cc1)NC(=O)CN(C)C2=O)C(C)C
InChI Key InChIKey=AOTYHUKYHIBKTR-MYBPPUCJSA-N
Data  2 IC50
  Tab Delimited (TSV)   2D SDfile   Computed 3D by Vconf -m prep SDfile
Find this compound or compounds like it in BindingDB:
Activity Spreadsheet -- Enzyme Inhibition Constant Data from BindingDB
Found 2 hits for monomerid = 50089533
TargetGrowth factor receptor-bound protein 2(Mus musculus)
Korea Research Institute Of Bioscience And Biotechnology
Curated by ChEMBL
LigandPNGBDBM50089533(Actinomycin D analogue | CHEMBL2369547)
Affinity DataIC50: >1.00E+4nM. Assay description: In vitro binding assay of Shc-derived phosphopeptide to Growth factor receptor bound protein 2 SH2 in B104-1-1 cells was determined
In DepthDetails ArticlePubMed
TargetGrowth factor receptor-bound protein 2(Mus musculus)
Korea Research Institute Of Bioscience And Biotechnology
Curated by ChEMBL
LigandPNGBDBM50089533(Actinomycin D analogue | CHEMBL2369547)
Affinity DataIC50:  800nM. Assay description: In vitro binding assay of Shc-derived phosphopeptide to Growth factor receptor bound protein 2 SH2 in B104-1-1 cells was determined
In DepthDetails ArticlePubMed